XUnternehmen.Kerndatenmodell als Ontologie
type: Ontology
abstract: Diese Ontologie ist die Darstellung des semantischen Datenmodells XUnternehmen.Kerndatenmodell.
bibliographic citation: Rinsche, L.; Strauß, C.; Strupp, A.; Repräsentation des XUnternehmen.Kerndatenmodells als Ontologie (2025)
created: 2025-09-29
creator: Annika Strupp
creator: Cornelia Strauß
creator: Ludger Rinsche
description: Diese Ontologie ist die formale Repräsentation des XUnternehmen.Kerndatenmodells als Ontologie, auf der Basis der Basic Formal Ontology (BFO).
description: This Ontology is the representation of semantic model XUnternehmen.Kerndatenmodell based on Basic Formal Ontology (BFO). @en
license: https://creativecommons.org/licenses/by/4.0/
preferred namespace prefix: kdm
code repository: https://gitlab.opencode.de/xunternehmen/kerndatenmodell-ontologie-owl
version info: Version 1.2

Anschrift
type: Class
definition: Abstraktes Kerndatenobjekt. Angaben für die Adressierung. Eine Anschrift ist entweder eine Inlands- oder eine Auslandsanschrift.

Anschrift Ausland
type: Class
subclass of: Anschrift
definition: Dies ist eine Konkretisierierung des Kerndatenobjektes Anschrift. Angaben für die Adressierung im Ausland.

Anschrift Inland
type: Class
subclass of: Anschrift
definition: Dies ist eine Konkretisierierung des Kerndatenobjektes Anschrift. Angaben für die Adressierung im Inland. Eine Inlandsanschrift ist entweder eine Straßenanschrift, eine Postfachanschrift oder eine Großempfängeranschrift.

Anschrift Inland Großempfängeranschrift
type: Class
subclass of: Anschrift Inland
definition: Dies ist eine Konkretisierierung des Kerndatenobjektes Anschrift Inland. Angaben für die Adressierung im Inland, soweit es sich um die Anschrift eines Großempfängers handelt.

Anschrift Inland Postfachanschrift
type: Class
subclass of: Anschrift Inland
definition: Dies ist eine Konkretisierierung des Kerndatenobjektes Anschrift Inland. Angaben für die Adressierung im Inland, soweit es sich um die Anschrift eines Postfachs handelt.

Anschrift Inland Straßenanschrift
type: Class
subclass of: Anschrift Inland
definition: Dies ist eine Konkretisierierung des Kerndatenobjektes Anschrift Inland. Angaben für die Adressierung im Inland, soweit es sich um die Anschrift eines Gebäudes handelt.

Ansprechpartner
type: Class
subclass of: BFO_0000023
definition: Dies ist eine Rolle, welche das Kerndatenobjekt Natürliche Person einnehmen kann. Angaben zu einem Ansprechpartner, welcher von der handelnden Person in einem konkreten Antrag eines wirtschaftlich Tätigen bzw. in einer konkreten Anzeige eines wirtschaftlich Tätigen benannt wird für Rückfragen seitens der zuständigen Stelle.

Antrag eines wirtschaftlichen Tätigen
type: Class
definition: Abstraktes Kerndatenobjekt. Mit diesem Kerndatenobjekt wird ein an eine zuständige öffentliche Stelle gerichteter Antrag eines wirtschaftlich Tätigen auf Durchführung eines Verwaltungsverfahrens in eigener Sache gemäß § 9 VwVfG gefasst.

Antragsteller
type: Class
subclass of: BFO_0000023
definition: Dies ist ist eine Rolle, welche die Kerndatenobjekte Natürliche Person, Juristische Person, Rechtsfähige Personengesellschaft, Sonstige Personenvereinigung und Wirtschaftliche Tätigkeit einnehmen können. Mit dieser Rolle wird die natürliche Person oder juristische Person oder die rechtsfähige Personengesellschaft oder sonstige Personenvereinigung identifiziert, die bei der zuständigen Stelle in eigener Sache den Erlass eines Verwaltungsakts beantragt oder durch einen Vertreter beantragen lässt und so die Durchführung eines Verwaltungsverfahrens im Sinne des § 9 VwVfG veranlasst. Der Antragsteller ist Beteiligter im Verwaltungsverfahren gemäß § 13 VwVfG.

Anzeige eines wirtschaftlichen Tätigen
type: Class
definition: Abstraktes Kerndatenobjekt. Mit diesem Kerndatenobjekt wird eine an die zuständige öffentliche Stelle gerichtete einseitige empfangsbedürftige Willenserklärung eines wirtschaftlich Tätigen in eigener Sache gefasst.

Anzeigender
type: Class
subclass of: BFO_0000023
definition: Dies ist eine Rolle, welche die Kerndatenobjekte Natürliche Person, Juristische Person, Rechtsfähige Personengesellschaft, Sonstige Personenvereinigung und Wirtschaftliche Tätigkeit einnehmen können. Mit dieser Rolle wird die natürliche Person oder juristische Person oder die rechtsfähige Personengesellschaft oder sonstige Personenvereinigung identifiziert, die bei der zuständigen Stelle in eigener Sache eine Anzeige erstattet oder durch einen Vertreter erstatten lässt.

Beteiligter einer sonstigen Personenvereinigung
type: Class
subclass of: BFO_0000023
definition: Dies ist eine Rolle, welche das Kerndatenobjekt Natürliche Person einnehmen kann. Mit dieser Rolle wird ein Beteiligter einer sonstigen Personenvereinigung gefasst.

Betriebsstätte
type: Class
definition: Dieses Kerndatenobjekt identifiziert einen Ort, an welchem eine wirtschaftliche Tätigkeit tatsächlich und grundsätzlich dauerhaft ausgeübt wird.

De-Mail
type: Class
subclass of: Kommunikation
definition: Dies ist eine Konkretisierierung des Kerndatenobjektes Kommunikation. Angabe einer De-Mail-Adresse.

Effektiver Verwaltungssitz
type: Class
definition: Der effektiver Verwaltungssitz ist - im Unterschied zum Sitz - der Ort, an dem sich die Hauptverwaltung befindet und die Geschäfte tatsächlich geführt werden.

Eintragung
type: Class
definition: Dieses Kerndatenobjekt fasst die Daten, mit welchen die Eintragung eines wirtschaftlich Tätigen bzw. einer wirtschaftlichen Tätigkeit in einem Handels-, Genossenschafts-,Gesellschafts-, Vereins-, Partnerschafts- oder Stiftungsregister sowie in einem Stiftungsverzeichnis identifiziert werden kann.

E-Mail
type: Class
subclass of: Kommunikation
definition: Dies ist eine Konkretisierierung des Kerndatenobjektes Kommunikation. Angabe einer E-Mail-Adresse.

Geburt
type: Class
definition: Angaben zur Geburt einer natürlichen Person.

Gesellschafter
type: Class
subclass of: BFO_0000023
definition: Dies ist eine Rolle, welche die Kerndatenobjekte Natürliche Person, Juristische Person und Rechtsfähige Personengesellschaft einnehmen können. Mit dieser Rolle wird ein Gesellschafter einer rechtsfähigen Personengesellschaft gefasst.

Gesetzlicher Vertreter
type: Class
subclass of: BFO_0000023
definition: Dies ist eine Rolle, welche die Kerndatenobjekte Natürliche Person und Juristische Person einnehmen können. Mit dieser Rolle wird der gesetzliche Vertreter einer juristischen Person oder natürlichen Person gefasst. Es handelt sich hierbei um Vertreter, deren Vertretungsmacht sich allein aus gesetzlichen Bestimmungen ergibt und nicht durch ein Rechtsgeschäft erteilt wurde.

Handelnde Person
type: Class
subclass of: BFO_0000023
definition: Dies ist eine Rolle, welche das Kerndatenobjekt Natürliche Person einnehmen kann. Mit dieser Rolle wird die natürliche Person identifiziert, die im konkreten Vorgang die Verfahrenshandlungen (beispielsweise einen Antrag stellt oder eine Anzeige einreicht) vornimmt.

Juristische Person
type: Class
subclass of: Agent
disjoint with: Sonstige Personenvereinigung
definition: Dieses Kerndatenobjekt umfasst die allgemeinen Angaben zu einer juristischen Person des privaten oder öffentlichen Rechts.

Kommunikation
type: Class
definition: Abstraktes Kerndatenobjekt. Angaben zu einer elektronischen Erreichbarkeit.

Name einer natürlichen Person
type: Class
definition: Datenobjekt zur Darstellung des Namens einer natürlichen Person in lateinischer Schrift, entsprechend der Vorgaben aus dem Baukasten des Föderalen Informationsmanagements (FIM).

Natürliche Person
type: Class
subclass of: Agent
definition: Dieses Kerndatenobjekt umfasst die allgemeinen Angaben zu einer natürlichen Person (Mensch), welche im fachlichen Kontext in mindestens einer und gegebenenfalls mehreren Rollen auftritt.

Rechtsfähige Personengesellschaft
type: Class
subclass of: Agent
disjoint with: Sonstige Personenvereinigung
definition: Dieses Kerndatenobjekt umfasst die allgemeinen Angaben zu einer rechtsfähigen Personengesellschaft.

Sitz
type: Class
definition: Der Sitz einer Körperschaft, Personenvereinigung oder Vermögensmasse ist der Ort, der durch Gesetz, Gesellschaftsvertrag, Satzung, Stiftungsgeschäft oder dergleichen bestimmt ist.

Sonstige Personenvereinigung
type: Class
subclass of: Agent
definition: Dieses Kerndatenobjekt umfasst die allgemeinen Angaben zu einer sonstigen Personenvereinigung. Unter diesem Kerndatenobjekt werden alle Personenvereinigungen gefasst, die weder unter juristische Personen noch unter rechtsfähige Personengesellschaften fallen.

Staat
type: Class
definition: Angabe eines Staats oder eines Staatsgebiets.

Telefax
type: Class
subclass of: Kommunikation
definition: Dies ist eine Konkretisierierung des Kerndatenobjektes Kommunikation. Angabe einer Telefaxnummer.

Telefon
type: Class
subclass of: Kommunikation
definition: Dies ist eine Konkretisierierung des Kerndatenobjektes Kommunikation. Angabe einer Telefonnummer.

Web-Adresse
type: Class
subclass of: Kommunikation
definition: Dies ist eine Konkretisierierung des Kerndatenobjektes Kommunikation. Angabe einer Web-Adresse.

Wirtschaftlich Tätiger
type: Class
subclass of: BFO_0000023
definition: Dies ist eine Rolle, welche die Kerndatenobjekte Natürliche Person, Juristische Person, Rechtsfähige Personengesellschaft und Sonstige Personenvereinigung einnehmen können. Bezogen #auf eine wirtschaftliche Tätigkeit bezeichnet diese Rolle die nach außen am Wirtschaftsleben teilnehmende Person bzw. Personenvereinigung.

Wirtschaftliche Tätigkeit
type: Class
subclass of: BFO_0000017
definition: Das Kerndatenobjekt Wirtschaftliche Tätigkeit umfasst in generischer Weise eine planmäßige, für eine gewisse Dauer bestimmte, selbstständige wirtschaftliche Tätigkeit eines wirtschaftlich Tätigen.

Wirtschaftszweig
type: Class
definition: Dieses Kerndatenobjekt modelliert die Angabe eines Wirtschaftszweigs gemäß der Klassifikation des statistischen Bundesamts. Es umfasst die Angabe des Wirtschaftszweigschlüssels und der angewendeten Version der Klassifikation.

hat Anschrift
type: ObjectProperty
domain: Class
  union of: Betriebsstätte
  union of: Juristische Person
  union of: Natürliche Person
  union of: Rechtsfähige Personengesellschaft
  union of: Sonstige Personenvereinigung
  union of: Wirtschaftliche Tätigkeit
range: Anschrift
definition: Verweis auf das Datenobjekt Anschrift einer wirtschaftlichen Tätigkeit, einer natürlichen Person, einer juristischen Person, einer rechtsfähigen Personengesellschaft oder einer sonstigen Personenvereinigung, ebenso einer Betriebsstätte einer wirtschaftlichen Tätigkeit.

hat Ansprechpartner
type: ObjectProperty
domain: Class
  union of: Antrag eines wirtschaftlichen Tätigen
  union of: Anzeige eines wirtschaftlichen Tätigen
range: Ansprechpartner
definition: Dies ist ein Verweis auf die Rolle Ansprechpartner, welche das Kerndatenobjekt Natürliche Person einnehmen kann.

Ansprechpartner ist
type: ObjectProperty
domain: Ansprechpartner
range: Natürliche Person
definition: Diese Eigenschaft dient dem Verweis auf die natürliche Person, die die Rolle des Ansprechpartners einnimmt.

hat Antragsteller
type: ObjectProperty
domain: Antrag eines wirtschaftlichen Tätigen
range: Antragsteller
definition: Dies ist ein Verweis auf die Rolle Antragsteller, welche die Kerndatenobjekte Natürliche Person, Juristische Person, Rechtsfähige Personengesellschaft, Sonstige Personenvereinigung und Wirtschaftliche Tätigkeit einnehmen können.

Antragsteller ist
type: ObjectProperty
domain: Antragsteller
range: Class
  union of: Juristische Person
  union of: Natürliche Person
  union of: Rechtsfähige Personengesellschaft
  union of: Sonstige Personenvereinigung
  union of: Wirtschaftliche Tätigkeit
definition: Diese Eigenschaft dient dem Verweis auf die Natürliche Person, Juristische Person, Rechtsfähige Personengesellschaft, Sonstige Personenvereinigung oder Wirtschaftliche Tätigkeit, die die Rolle des Antragstellers einnehmen.

hat Anzeigenden
type: ObjectProperty
domain: Anzeige eines wirtschaftlichen Tätigen
range: Anzeigender
definition: Dies ist ein Verweis auf die Rolle Anzeigender.

Anzeigender ist
type: ObjectProperty
domain: Anzeigender
range: Class
  union of: Juristische Person
  union of: Natürliche Person
  union of: Rechtsfähige Personengesellschaft
  union of: Sonstige Personenvereinigung
  union of: Wirtschaftliche Tätigkeit
definition: Diese Eigenschaft dient dem Verweis auf die Natürliche Person, Juristische Person, Rechtsfähige Personengesellschaft, Sonstige Personenvereinigung oder Wirtschaftliche Tätigkeit, die die Rolle des Anzeigenden einnehmen.

Art der Angabe des Antragstellers oder des Anzeigenden
type: DatatypeProperty
domain: Class
  union of: Antragsteller
  union of: Anzeigender
range: angabeantragstelleranzeigender
definition: Angabe der Angabenart des Antragstellers oder des Anzeigenden in einem Antrag oder einer Anzeige. Hier wird angegeben, ob die natürliche oder juristische Person bzw. die rechtsfähige Personengesellschaft des Anzeigenden explizit angegeben wird oder ob lediglich seine wirtschaftliche Tätigkeit angegeben wird und der Anzeigende damit implizit bestimmt ist.

Art der Anschrift
type: DatatypeProperty
domain: Class
  union of: Anschrift Ausland
  union of: Anschrift Inland Großempfängeranschrift
  union of: Anschrift Inland Postfachanschrift
  union of: Anschrift Inland Straßenanschrift
range: artanschrift
definition: Angabe der Rolle oder Funktion einer Anschrift, z. B. einer Geschäftsanschrift oder Wohnsitzadresse.

Art der Betriebsstätte
type: DatatypeProperty
domain: Betriebsstätte
range: artniederlassung
definition: Nähere Bestimmung der Art der Betriebsstätte. Die möglichen Ausprägungen dieses Attributes sind durch die Codeliste Art einer Niederlassung (https://www.xrepository.de/details/urn:xoev-de:xunternehmen:codeliste:artniederlassung) im XRepository bestimmt.

Art der Eintragung
type: DatatypeProperty
domain: Eintragung
range: artdereintragung
definition: Angabe der Art des Registers, in welchem ein wirtschaftlich Tätiger bzw. eine wirtschaftliche Tätigkeit geführt wird.

Art des Gesellschafters
type: DatatypeProperty
domain: Gesellschafter
range: artgesellschafterpersonengesellschaft
definition: Angabe der Art eines Gesellschafters einer Personengesellschaft
note: Hier ist der Codelistenwert der Codeliste Art des Gesellschafters (https://www.xrepository.de/details/urn:xoev-de:xunternehmen:codeliste:artgesellschafterpersonengesellschaft) anzugeben, beispielsweise 02 für einen persönlich haftenden Gesellschafter.

Art des Gesetzlichen Vertreters
type: DatatypeProperty
domain: Gesetzlicher Vertreter
range: artgesetzlichervertreter
definition: Angabe der Art des Gesetzlichen Vertreters.
note: Hier ist der Codelistenwert (= String) der Codeliste Art des Gesetzlichen Vertreters (https://www.xrepository.de/details/urn:xoev-de:xunternehmen:codeliste:artgesetzlichervertreter) anzugeben, beispielsweise 3 für Vorstand.

hat Beteiligten
type: ObjectProperty
domain: Rechtsfähige Personengesellschaft
range: Beteiligter einer sonstigen Personenvereinigung
definition: Dies ist ein Verweis auf die Rolle Beteiligter, welche das Kerndatenobjekt Natürliche Person einnehmen kann. Mit dieser Rolle wird ein Beteiligter einer sonstigen Personenvereinigung gefasst.

Beteiligter ist
type: ObjectProperty
domain: Beteiligter einer sonstigen Personenvereinigung
range: Natürliche Person
definition: Diese Eigenschaft dient dem Verweis auf die natürliche Person, die die Rolle des Beteiligten einnimmt.

hat Betriebsstätte
type: ObjectProperty
domain: Wirtschaftliche Tätigkeit
range: Betriebsstätte
definition: Verweis auf das Datenobjekt Betriebsstätte einer wirtschaftlichen Tätigkeit.

Bundeseinheitliche Wirtschaftsnummer
type: DatatypeProperty
domain: Class
  union of: Juristische Person
  union of: Rechtsfähige Personengesellschaft
  union of: Sonstige Personenvereinigung
  union of: Wirtschaftliche Tätigkeit
range: string
definition: Angabe der bundeseinheitlichen Wirtschaftsnummer für Unternehmen gemäß § 2 UBRegG.

hat De-Mail
type: ObjectProperty
domain: Kommunikation
range: De-Mail
definition: Dies ist ein Verweis auf die Angaben zur Erreichbarkeit per De-Mail.

De-Mail-Adresse
type: DatatypeProperty
domain: De-Mail
range: string
definition: De-Mail-Adresse, strukturiert gemäß BSI TR-01201 De-Mail. Beispiel: erika.mustermann@mustermann.de-mail.de.

Doktorgrad
type: DatatypeProperty
domain: Natürliche Person
range: string
definition: Es sind nur diejenigen Doktorgrade anzugeben, die in Pässe eingetragen werden dürfen. Sind mehrere Doktorgrade anzugeben, so sind sie durch ein Leerzeichen zu trennen.

hat effektiven Verwaltungssitz
type: ObjectProperty
domain: Class
  union of: Juristische Person
  union of: Rechtsfähige Personengesellschaft
  union of: Sonstige Personenvereinigung
range: Effektiver Verwaltungssitz
definition: Verweis auf das Datenobjekt Effektiver Verwaltungssitz einer juristischen Person, einer rechtsfähigen Personengesellschaft oder einer sonstigen Personenvereinigung.

eingetragenen Namen
type: DatatypeProperty
domain: Class
  union of: Juristische Person
  union of: Rechtsfähige Personengesellschaft
  union of: Sonstige Personenvereinigung
  union of: Wirtschaftliche Tätigkeit
range: string
definition: Die im Handels-, Genossenschafts- oder Gesellschaftsregister eingetragene Firma eines wirtschaftlich Tätigen oder einer wirtschaftlichen Tätigkeit (z. B. eingetragenes Einzelunternehmen, eingetragene Zweigniederlassung) bzw. der im Vereins-, Partnerschafts- oder Stiftungsregister oder im Stiftungsverzeichnis eingetragene Name.

hat Eintragung
type: ObjectProperty
domain: Class
  union of: Juristische Person
  union of: Rechtsfähige Personengesellschaft
  union of: Sonstige Personenvereinigung
  union of: Wirtschaftliche Tätigkeit
range: Eintragung
definition: Verweis auf das Datenobjekt Eintragung einer Wirtschaftlichen Tätigkeit, einer Juristischen Person, einer Rechtsfähigen Personengesellschaft oder einer Sonstigen Personenvereinigung.

Eintragungsnummer
type: DatatypeProperty
domain: Eintragung
range: string
definition: Nummer der Eintragung im jeweiligen Register bzw. Aktenzeichen im Stiftungsverzeichnis. Sofern zum Zwecke der Eindeutigkeit der Eintragungsnummer im angegebenen Register ein Ortskennzeichen verwendet wird, wird dieses ebenfalls, durch Leerzeichen getrennt, in diesem Attribut angegeben (Beispiele: 12345 KI, 12345 FL).

hat E-Mail
type: ObjectProperty
domain: Kommunikation
range: E-Mail
definition: Dies ist ein Verweis auf die Angaben zur Erreichbarkeit per E-Mail.

E-Mail-Adresse
type: DatatypeProperty
domain: E-Mail
range: string
definition: E-Mail-Adresse.

Familienname
type: DatatypeProperty
domain: Name einer natürlichen Person
range: string
definition: Familienname einer natürlichen Person bestehend aus Nachname, Zuname bzw. Familienname.

Familienname nicht vorhanden
type: DatatypeProperty
domain: Name einer natürlichen Person
range: boolean
definition: Angabe, dass die betreffende Person keinen Familiennamen führt.

Früherer Gemeindename
type: DatatypeProperty
domain: Anschrift Inland Straßenanschrift
range: string
definition: Der frühere Gemeindename, der als Stadt- bzw. Ortsteilname dem jetzigen Gemeindenamen hinzugefügt wird. Der frühere Gemeindename (jetziger Ortsteil- oder Stadtteilname) ist bei Adressierungen unterhalb des Namens (oberhalb der Straßenbezeichnung) anzugeben.

hat Geburt
type: ObjectProperty
domain: Natürliche Person
range: Geburt
definition: Verweis auf das Datenobjekt Geburt einer natürlichen Person.

Geburtsdatum
type: DatatypeProperty
comment: Die Datumsangabe per xsd:date, xsd:gYear oder xsd:gYearMonth ist im Format zu restriktiv, da an dieser Stelle im XUnternehmen.Kerndatenmodell keine Beschränkungen gemacht werden bzw. auf eine deutsche Datumgsangabe zurückzugreifen ist.
domain: Geburt
range: string
definition: Datum der Vollendung der Geburt. Diese Angabe ist als teilbekannte Datumsangabe zu machen. Eine teilbekannte Datumsangabe umfasst die Komponenten Tag, Monat und Jahr, die Komponenten Monat und Jahr oder nur die Komponente Jahr.

Geburtsname
type: DatatypeProperty
domain: Name einer natürlichen Person
range: string
definition: Der Geburtsname entspricht dem Familiennamen einer natürlichen Person vor der Schließung der ersten Ehe bzw. vor dem Eingehen der ersten Lebenspartnerschaft.

Geburtsname nicht vorhanden
type: DatatypeProperty
domain: Name einer natürlichen Person
range: boolean
definition: Angabe, dass vor der Eheschließung oder vor der Begründung der Lebenspartnerschaft nach dem für die Namensführung maßgebenden Recht kein Familienname vorhanden gewesen ist.

Gemeindeschlüssel
type: DatatypeProperty
domain: Anschrift Inland Straßenanschrift
range: ags
definition: Der vom Statistischen Bundesamt herausgegebene bundeseinheitliche Gemeindeschlüssel der Gemeinde, in welcher die Anschrift liegt.

Geschäftsbezeichnung
type: DatatypeProperty
domain: Wirtschaftliche Tätigkeit
range: string
definition: Im Geschäftsverkehr einer wirtschaftlichen Tätigkeit verwendeter Name. Dieser kann abweichen von einem ggf. im Handel-, Genossenschafts-, Gesellschafts-, Partnerschafts- oder Vereinsregister eingetragen Namen.

Geschlecht
type: DatatypeProperty
domain: Natürliche Person
range: geschlecht
definition: Als Geschlechtsangabe zulässig sind: männlich, weiblich, divers, keine Angabe.

hat Gesellschafter
type: ObjectProperty
domain: Personengesellschaft
range: Gesellschafter
definition: Dies ist ein Verweis auf die Rolle Gesellschafter, welche die Kerndatenobjekte Natürliche Person, Juristische Person und Rechtsfähige Personengesellschaft einnehmen können.

Gesellschafter ist
type: ObjectProperty
domain: Gesellschafter
range: Class
  union of: Juristische Person
  union of: Natürliche Person
  union of: Rechtsfähige Personengesellschaft
definition: Diese Eigenschaft dient dem Verweis auf die natürliche Person, Jjuristische Person oder rechtsfähige Personengesellschaft, die die Rolle des Gesellschafters einnehmen.

hat gesetzlichen Vertreter
type: ObjectProperty
domain: Gesetzlicher Vertreter
domain: Class
  union of: Juristische Person
  union of: Natürliche Person
definition: Dies ist ein Verweis auf die Rolle Gesetzlicher Vertreter, welche die Kerndatenobjekte Natürliche Person und Juristische Person einnehmen können.

Gesetzlicher Vertreter ist
type: ObjectProperty
domain: Gesetzlicher Vertreter
range: Class
  union of: Juristische Person
  union of: Natürliche Person
definition: Diese Eigenschaft dient dem Verweis auf die natürliche Person oder die juristische Person, die die Rolle des gesetzlichen Vertreters einnehmen.

hat handelnde Person
type: ObjectProperty
domain: Class
  union of: Antrag eines wirtschaftlichen Tätigen
  union of: Anzeige eines wirtschaftlichen Tätigen
range: Handelnde Person
definition: Dies ist ein Verweis auf die Rolle Handelnde Person, welche die Kerndatenobjekte Natürliche Person, Juristische Person, Rechtsfähige Personengesellschaft, Sonstige Personenvereinigung und Wirtschaftliche Tätigkeit einnehmen können.

Handelnde Person ist
type: ObjectProperty
domain: Handelnde Person
range: Natürliche Person
definition: Diese Eigenschaft dient dem Verweis auf die natürliche Person, die die Rolle der handelnden Person einnimmt.

Hausnummer
type: DatatypeProperty
domain: Class
  union of: Anschrift Ausland
  union of: Anschrift Inland Straßenanschrift
range: string
definition: Die vollständige Hausnummer, ggf. inkl. Buchstabe/Zusatzziffern und Teilnummer.

Identifikationsnummer
type: DatatypeProperty
domain: Natürliche Person
range: string
definition: Identifikationsnummer einer natürlichen Person gemäß IDNrG.

Klassifikation der Kommunikationsangabe
type: DatatypeProperty
domain: Kommunikation
range: klassifikationkommunikation
definition: Eine Klassifikation der Kommunikationsangabe (privat, geschäftlich, ...).

hat Kommunikation
type: ObjectProperty
domain: Class
  union of: Betriebsstätte
  union of: Juristische Person
  union of: Natürliche Person
  union of: Rechtsfähige Personengesellschaft
  union of: Sonstige Personenvereinigung
  union of: Wirtschaftliche Tätigkeit
range: Kommunikation
definition: Verweis auf das Datenobjekt Kommunikation einer wirtschaftlichen Tätigkeit, einer natürlichen Person, einer juristischen Person, einer rechtsfähigen Personengesellschaft oder einer sonstigen Personenvereinigung, ebenso einer Betriebsstätte einer wirtschaftlichen Tätigkeit.

Hinweis zur Kommunikation
type: DatatypeProperty
domain: Kommunikation
range: string
definition: Ein ergänzender Hinweis zur Verwendung dieser Kommunikationsangabe.

hat Namen
type: ObjectProperty
domain: Natürliche Person
range: Name einer natürlichen Person
definition: Verweis auf das Datenobjekt Name einer natürlichen Person.

Ort
type: DatatypeProperty
domain: Class
  union of: Anschrift Ausland
  union of: Anschrift Inland Großempfängeranschrift
  union of: Anschrift Inland Postfachanschrift
  union of: Anschrift Inland Straßenanschrift
  union of: Effektiver Verwaltungssitz
  union of: Eintragung
  union of: Sitz
range: string
definition: Der Name des Ortes (Gemeinde, Ortschaft oder Stadt).

Ort der Geburt
type: DatatypeProperty
domain: Geburt
range: string
definition: Der Ort der Geburt einer natürlichen Person.

Postfach
type: DatatypeProperty
domain: Anschrift Inland Großempfängeranschrift
range: string
definition: Ein Postfach (oft Postfachnummer) ist ein Schlüssel zur Identifikation eines Postfaches in einer Postfiliale.

Postleitzahl
type: DatatypeProperty
domain: Class
  union of: Anschrift Ausland
  union of: Anschrift Inland Großempfängeranschrift
  union of: Anschrift Inland Postfachanschrift
  union of: Anschrift Inland Straßenanschrift
range: string
definition: Es ist die Postleitzahl anzugeben.

Rechtsform
type: DatatypeProperty
domain: Class
  union of: Juristische Person
  union of: Rechtsfähige Personengesellschaft
  union of: Sonstige Personenvereinigung
  union of: Wirtschaftliche Tätigkeit
range: rechtsformen
definition: Die Codeliste der Rechtsformen bildet ab Version 2 fachbereichsübergreifend Anforderungen an die Codierung von Rechtsforminformationen ab und ermöglicht deren bereichsübergreifend einheitliche Codierung und Übermittlung. Aktuell werden die Anforderungen aus dem Grundinformationsdienst GINSTER der Steuerverwaltung und damit auch der Codierung im ELSTER-Unternehmenskonto, aus dem Registerportal der Handels-, Genossenschafts-, Partnerschafts- und Vereinsregister, dem Standard XGewerbeanzeige / XGewerbeordnung und damit auch dem Unternehmerverzeichnis der gesetzlichen Unfallversicherung umgesetzt. Auf diese Weise können beispielweise Rechtsforminformationen ohne semantische Brüche aus dem ELSTER-Unternehmenskonto über einen Online-Dienst zur Gewerbeanmeldung an die zuständige Gewerbebehörde übermittelt werden und dort mit Daten aus dem Registerportal der Justiz und (perspektivisch) mit dem Basisregister gemäß UBRegG zusammengeführt werden. Seit Version 2 sind die Codes sechsstellig und hierarchisch gegliedert, um unterschiedliche Granularitäten der Rechtsformdifferenzierung zu unterstützen und Codes einfacher zueinander in Bezug setzen zu können. Die Version 2 der Rechtsformcodierung ist vollständig rückwärtskompatibel zur Version 1 in dem Sinne, dass eine Eins-zu-eins-Umschlüsselung der bisherigen Codes erfolgen kann.

Bezeichnung Registergericht
type: DatatypeProperty
domain: Eintragung
range: string
definition: Bezeichnung des Registergerichts, in dessen Register der wirtschaftlich Tätige bzw. die wirtschaftliche Tätigkeit (z. B. Zweigniederlassung) geführt wird.

Registergericht Code
type: DatatypeProperty
domain: Eintragung
range: registergerichte
definition: Schlüssel des Registergerichts, in dessen Register der wirtschaftlich Tätige bzw. die wirtschaftliche Tätigkeit (z. B. Zweigniederlassung) geführt wird.

hat Sitz
type: ObjectProperty
domain: Class
  union of: Juristische Person
  union of: Rechtsfähige Personengesellschaft
  union of: Sonstige Personenvereinigung
range: Sitz
definition: Verweis auf das Datenobjekt Sitz einer juristischen Person, einer rechtsfähigen Personengesellschaft oder einer sonstigen Personenvereinigung.

Staat
type: DatatypeProperty
domain: Class
  union of: Anschrift Ausland
  union of: Effektiver Verwaltungssitz
  union of: Eintragung
  union of: Geburt
  union of: Sitz
range: string
definition: Angabe eines Staats oder eines Staatsgebiets. Je nach fachlichem und rechtlichem Kontext bzw. dem jeweiligen Ziel der Datenerhebung kann diese Angabe mit unterschiedlich umfangreichen und unterschiedlich fein aufgelösten Codelisten codiert werden. Der Standard XUnternehmen.Kerndatenmodell gibt entsprechend keine einheitliche Codeliste vor, sondern lässt die Verwendung unterschiedlicher Codelisten, im Wesentlichen aus der Staats- und Gebietssystematik (BEV) des Statistischen Bundesamts zu.

Staatsangehörigkeit Code
type: DatatypeProperty
domain: Natürliche Person
range: staatsangehoerigkeit
definition: Die Staatsangehörigkeit der natürlichen Person gemäß Codierung des statistischen Bundesamts.

Stiftungsverzeichnis in
type: DatatypeProperty
domain: Eintragung
range: string
definition: Bei Einträgen im Stiftungsverzeichnis: Angabe des Bundeslandes bzw. der Behörde, in dessen oder deren Stiftungsverzeichnis der Eintrag geführt wird.

Straße
type: DatatypeProperty
domain: Class
  union of: Anschrift Ausland
  union of: Anschrift Inland Straßenanschrift
range: string
definition: Es ist die Bezeichnung der Straße anzugeben.

Tätigkeit
type: DatatypeProperty
domain: Wirtschaftliche Tätigkeit
range: string
definition: Benennung bzw. Bezeichnung der ausgeübten Tätigkeit.

hat Telefax
type: ObjectProperty
domain: Kommunikation
range: Telefax
definition: Dies ist ein Verweis auf die Angaben zur Erreichbarkeit per Telefax.

Telefaxnummer
type: DatatypeProperty
domain: Telefax
range: string
definition: Telefaxnummer, strukturiert gemäß ITU E.123. Beispiel: +49 421 1234567, +49 421 123 4567, (0421) 1234567. Die Angabe soll möglichst gemäß DIN 5008 aufgebaut sein.

hat Telefon
type: ObjectProperty
domain: Kommunikation
range: Telefon
definition: Dies ist ein Verweis auf die Angaben zur telefonischen Erreichbarkeit.

Telefonnummer
type: DatatypeProperty
domain: Telefon
range: string
definition: Telefonnummer, strukturiert gemäß ITU E.123. Beispiel: +49 421 1234567, +49 421 123 4567, (0421) 1234567. Die Angabe soll möglichst gemäß DIN 5008 aufgebaut sein.

Version der Wirtschaftszweigklassifikation
type: DatatypeProperty
domain: Wirtschaftszweig
range: wirtschaftszweigklassifikationsversion
definition: Version der Klassifikation der Wirtschaftszweige, bspw. WZ-2008. Die möglichen Ausprägungen dieses Attributes sind durch die Codeliste Wirtschaftszweigklassifikation im XRepository bestimmt.

Vornamen
type: DatatypeProperty
domain: Name einer natürlichen Person
range: string
definition: Vornamen einer natürlichen Person.

Geburtsname nicht vorhanden
type: DatatypeProperty
domain: Name einer natürlichen Person
range: boolean
definition: Angabe, dass die betreffende Person keinen Vornamen führt.

hat Web-Adresse
type: ObjectProperty
domain: Kommunikation
range: Web-Adresse
definition: Dies ist ein Verweis auf die Angaben zur Erreichbarkeit per Web-Adresse.

Web-Adresse
type: DatatypeProperty
domain: Web-Adresse
range: string
definition: Web-Adresse.

hat Wirtschaftlich Tätigen
type: ObjectProperty
domain: Wirtschaftliche Tätigkeit
range: Wirtschaftlich Tätiger
definition: Dies ist ein Verweis auf die Rolle Wirtschaftlich Tätiger, welche die Kerndatenobjekte Natürliche Person, Juristische Person, Rechtsfähige Personengesellschaft und Sonstige Personenvereinigung einnehmen können.

Wirtschaftlich Tätiger ist
type: ObjectProperty
domain: Wirtschaftlich Tätiger
range: Class
  union of: Juristische Person
  union of: Natürliche Person
  union of: Rechtsfähige Personengesellschaft
  union of: Sonstige Personenvereinigung
definition: Diese Eigenschaft dient dem Verweis auf die natürliche Person, juristische Person, rechtsfähige Personengesellschaft oder sonstige Personenvereinigung, die die Rolle des Wirtschaftlich Tätigen einnehmen.

hat Wirtschaftszweig
type: ObjectProperty
domain: Wirtschaftliche Tätigkeit
range: Wirtschaftszweig
definition: Verweis auf das Datenobjekt Wirtschaftszweig einer wirtschaftlichen Tätigkeit.

Wirtschaftszweigschlüssel
type: DatatypeProperty
domain: Wirtschaftszweig
range: string
definition: Wirtschaftszweigschlüssel gemäß der Klassifikation der Wirtschaftszweige des Statistischen Bundesamts. Umsetzungshinweis: Die Angabe erfolgt ausschließlich in Ziffern, ohne Trennzeichen. Es sind bis zu 5 Ziffern zulässig.

Wohnungsinhaber
type: DatatypeProperty
domain: Anschrift Inland Straßenanschrift
range: string
definition: Der Name des Wohnungsinhabers, soweit dies zur Adressierung erforderlich ist. Max Mustermann bei Müller; Max Mustermann c/o Schmidt.

Zusatzangaben
type: DatatypeProperty
domain: Class
  union of: Anschrift Ausland
  union of: Anschrift Inland Straßenanschrift
range: string
definition: Es sind Zusatzangaben zur Anschrift anzugeben. Beispiele: Hinterhaus, Gartenhaus.

ags
type: Datatype
equivalent class: string
scope note: Mit diesem Datentyp sollen nur Codelistenwerte (= Strings) angegeben werden, die in der Codeliste Amtlicher Gemeindeschlüssel ausgezeichnet werden.

staatsangehoerigkeit
type: Datatype
equivalent class: string
scope note: Mit diesem Datentyp sollen nur Codelistenwerte (= Strings) angegeben werden, die in der Codeliste Staatsabgehörigkeit ausgezeichnet werden.

geschlecht
type: Datatype
equivalent class: string
scope note: Mit diesem Datentyp sollen nur Codelistenwerte (= Strings) angegeben werden, die in der Codeliste Geschlecht ausgezeichnet werden.

angabeantragstelleranzeigender
type: Datatype
equivalent class: string
scope note: Mit diesem Datentyp sollen nur Codelistenwerte (= Strings) angegeben werden, die in der Codeliste Angabe des Antragstellers/Anzeigenden ausgezeichnet werden

artanschrift
type: Datatype
equivalent class: string
scope note: Mit diesem Datentyp sollen nur Codelistenwerte (= Strings) angegeben werden, die in der Codeliste Art der Anschrift ausgezeichnet werden.

artdereintragung
type: Datatype
equivalent class: string
scope note: Mit diesem Datentyp sollen nur Codelistenwerte (= Strings) angegeben werden, die in der Codeliste Art der Eintragung ausgezeichnet werden.

artgesellschafterpersonengesellschaft
type: Datatype
equivalent class: string
scope note: Mit diesem Datentyp sollen nur Codelistenwerte (= Strings) angegeben werden, die in der Codeliste Art eines Gesellschafters einer Personengesellschaft ausgezeichnet werden.

artgesetzlichervertreter
type: Datatype
equivalent class: string
scope note: Mit diesem Datentyp sollen nur Codelistenwerte (= Strings) angegeben werden, die in der Codeliste Art des Gesetzlichen Vertreters ausgezeichnet werden.

artniederlassung
type: Datatype
equivalent class: string
scope note: Mit diesem Datentyp sollen nur Codelistenwerte (= Strings) angegeben werden, die in der Codeliste Art der Niederlassung ausgezeichnet werden.

klassifikationkommunikation
type: Datatype
equivalent class: string
scope note: Mit diesem Datentyp sollen nur Codelistenwerte (= Strings) angegeben werden, die in der Codeliste Klassifikation der Kommunikationsangabe ausgezeichnet werden.

rechtsformen
type: Datatype
equivalent class: string
scope note: Mit diesem Datentyp sollen nur Codelistenwerte (= Strings) angegeben werden, die in der Rechtsformen-Codeliste ausgezeichnet werden.

registergerichte
type: Datatype
equivalent class: string
scope note: Mit diesem Datentyp sollen nur Codelistenwerte (= Strings) angegeben werden, die in der Codeliste Registergericht Code ausgezeichnet werden.

wirtschaftszweigklassifikationsversion
type: Datatype
equivalent class: string
scope note: Mit diesem Datentyp sollen nur Codelistenwerte (= Strings) angegeben werden, die in der Codeliste Version der Wirtschaftszweigklassifikation ausgezeichnet werden.